BDBM408158 (S)-2-(4-(1-(2,3-dihydrobenzo[b][1,4]dioxin-6-yl)ethyl)piperazin-1-yl)-N-ethylthiazole-5-carboxamide or (R)-2-(4-(1-(2,3-dihydrobenzo[b][1,4]dioxin-6-yl)ethyl)piperazin-1-yl)-N-ethylthiazole-5-carboxamide::US10336775, Example 62
SMILES CCNC(=O)c1cnc(s1)N1CCN(CC1)C(C)c1ccc2OCCOc2c1
InChI Key InChIKey=REEIGRIOQGUZRL-UHFFFAOYSA-N
Data  1 IC50
  Tab Delimited (TSV)   2D SDfile   Computed 3D by Vconf -m prep SDfile
Find this compound or compounds like it in BindingDB:
Activity Spreadsheet -- Enzyme Inhibition Constant Data from BindingDB
Found 1 hit for monomerid = 408158
TargetProtein O-GlcNAcase(Homo sapiens (Human))
Asceneuron
US Patent
LigandPNGBDBM408158((S)-2-(4-(1-(2,3-dihydrobenzo[b][1,4]dioxin-6-yl)e...)
Affinity DataIC50:  125nM. Assay description: 5 μl of the appropriate concentration of a solution of inhibitor in McIlvaine's Buffer (pH 6.5) in 2% DMSO (for a dose response curve calcul...
Ligand InfoPC cidPC sid
In DepthDetails US Patent